Results 1 to 2 of 2

Thread: Skeleton Project Fails to Build

  1. #1
    Sencha User
    Join Date
    Sep 2014
    Posts
    5

    Default Skeleton Project Fails to Build

    So, in order to solve a problem using Sencha Cmd on Linux with multiple users (build server), now everyone is required to install it in their home directory (much like how Windows users would use the tool).

    I created a new directory and decided to run a test ...

    cd newdir
    sencha -sdk=path/to/extjs/4.2.1 generate app newapp `pwd`
    sencha app build production

    but I get the classic

    [ERR] BUILD FAILED
    [ERR] com.sencha.exceptions.ExProcess: compass process exited with non-zero code : 1

    as a result. Any clues on what to look at? (I tried ruby versions 1.8.6, 1.9.4, and 2.1.2.)

    detailed output:

    Sencha Cmd v5.0.0.160
    [INF] Processing Build Descriptor : default
    [INF] Loading app json manifest...
    [INF] Concatenating output to file /homes/bramankp/test/newdir/build/temp/production/GIM/sencha-compiler/cmd-packages.js
    [INF] Concatenating output to file /homes/bramankp/test/newdir/build/temp/production/GIM/__core.files
    [INF] Concatenating output to file /homes/bramankp/test/newdir/build/temp/production/GIM/__manifest
    [INF] Concatenating output to file /homes/bramankp/test/newdir/build/temp/production/GIM/__class.metadata
    [INF] Appending concatenated output to file /homes/bramankp/test/newdir/build/temp/production/GIM/__class.metadata
    [INF] Appending concatenated output to file /homes/bramankp/test/newdir/build/temp/production/GIM/__class.metadata
    [INF] Appending concatenated output to file /homes/bramankp/test/newdir/build/temp/production/GIM/__class.metadata
    [INF] Concatenating output to file /homes/bramankp/test/newdir/build/temp/production/GIM/__override.files
    [INF] Appending content to /homes/bramankp/test/newdir/bootstrap.js
    [INF] Appending content to /homes/bramankp/test/newdir/bootstrap.json
    [INF] Compressing data with YuiJavascriptCompressor
    [INF] Concatenating output to file /homes/bramankp/test/newdir/build/production/GIM/app.js
    [INF] merging resources into /homes/bramankp/test/newdir/build/production/GIM/resources
    [INF] merged 0 resources into /homes/bramankp/test/newdir/build/production/GIM/resources
    [INF] merging resources into /homes/bramankp/test/newdir/build/production/GIM
    [INF] merged 0 resources into /homes/bramankp/test/newdir/build/production/GIM
    [INF] writing sass content to /homes/bramankp/test/newdir/build/temp/production/GIM/sass/GIM-all.scss.tmp
    [INF] appending sass content to /homes/bramankp/test/newdir/build/temp/production/GIM/sass/GIM-all.scss.tmp
    [INF] appending sass content to /homes/bramankp/test/newdir/build/temp/production/GIM/sass/GIM-all.scss.tmp
    [INF] executing compass using system installed ruby runtime
    [ERR]
    [ERR] BUILD FAILED
    [ERR] com.sencha.exceptions.ExProcess: compass process exited with non-zero code : 1
    [ERR]
    [ERR] Total time: 15 seconds
    [ERR] The following error occurred while executing this line:
    /homes/bramankp/test/newdir/.sencha/app/build-impl.xml:278: The following error occurred while executing this line:
    /homes/bramankp/test/newdir/.sencha/app/sass-impl.xml:155: The following error occurred while executing this line:
    /homes/bramankp/test/newdir/.sencha/app/sass-impl.xml:168: com.sencha.exceptions.ExProcess: compass process exited with non-zero code : 1

  2. #2
    Sencha User
    Join Date
    Sep 2014
    Posts
    5

    Default

    After learning about the "-debug" switch and figuring out rubygems was not installed I am now running into *this* error:

    [DBG] ruby detected, checking for version in : ruby 1.8.6 (2010-02-05 patchlevel 399) [i386-linux]


    [DBG] setting GEM_HOME to /dun/homes/bramankp/Sencha/Cmd/5.0.0.160/extensions/sencha-compass/gems
    [INF] executing compass using system installed ruby runtime
    [DBG] executing compass : ruby /dun/homes/bramankp/Sencha/Cmd/5.0.0.160/extensions/sencha-compass/gems/bin/compass compile --config /dun/homes/bramankp/test/sencha/skeleton/build/temp/production/skeleton/sass/config.rb --css-dir /dun/homes/bramankp/test/sencha/skeleton/build/production/skeleton/resources --sass-dir /dun/homes/bramankp/test/sencha/skeleton/build/temp/production/skeleton/sass --force --trace
    /dun/homes/bramankp/Sencha/Cmd/5.0.0.160/extensions/sencha-compass/gems/gems/sass-3.1.7/lib/sass/../sass/util.rb:41:in `[]': odd number of arguments for Hash (ArgumentError)
    from /dun/homes/bramankp/Sencha/Cmd/5.0.0.160/extensions/sencha-compass/gems/gems/sass-3.1.7/lib/sass/../sass/util.rb:41:in `to_hash'
    from /dun/homes/bramankp/Sencha/Cmd/5.0.0.160/extensions/sencha-compass/gems/gems/sass-3.1.7/lib/sass/../sass/util.rb:73:in `map_vals'
    from /dun/homes/bramankp/Sencha/Cmd/5.0.0.160/extensions/sencha-compass/gems/gems/sass-3.1.7/lib/sass/../sass/script/color.rb:39
    from /usr/lib/ruby/site_ruby/1.8/rubygems/custom_require.rb:31:in `gem_original_require'
    from /usr/lib/ruby/site_ruby/1.8/rubygems/custom_require.rb:31:in `require'
    from /dun/homes/bramankp/Sencha/Cmd/5.0.0.160/extensions/sencha-compass/gems/gems/sass-3.1.7/lib/sass/../sass/script/literal.rb:10
    from /usr/lib/ruby/site_ruby/1.8/rubygems/custom_require.rb:31:in `gem_original_require'
    from /usr/lib/ruby/site_ruby/1.8/rubygems/custom_require.rb:31:in `require'
    ... 30 levels...
    from /dun/homes/bramankp/Sencha/Cmd/5.0.0.160/extensions/sencha-compass/gems/gems/compass-0.12.2/bin/compass:8:in `fallback_load_path'
    from /dun/homes/bramankp/Sencha/Cmd/5.0.0.160/extensions/sencha-compass/gems/gems/compass-0.12.2/bin/compass:19
    from /dun/homes/bramankp/Sencha/Cmd/5.0.0.160/extensions/sencha-compass/gems/bin/compass:23:in `load'
    from /dun/homes/bramankp/Sencha/Cmd/5.0.0.160/extensions/sencha-compass/gems/bin/compass:23
    [DBG] exit code was : 1
    [DBG] exit code was : 1
    [ERR]
    [ERR] BUILD FAILED
    [ERR] com.sencha.exceptions.ExProcess: compass process exited with non-zero code : 1

Posting Permissions

  • You may not post new threads
  • You may not post replies
  • You may not post attachments
  • You may not edit your posts
  •