PDA

View Full Version : Disabling framework : current version 6.0.0.640 is incompatible with required version



sankar22222
15 Mar 2017, 11:37 AM
Clear

















‚Äč





Sencha Architect Version 4.1.2 Getting error after installed new Architect version. Its conflicting with something. Unable to build the files


[INF] Processing Build Descriptor : default
[WRN] Disabling framework : current version 6.0.0.640 is incompatible with required version 6.2.1.167
[INF] Starting server on port : 0
[INF] Mapping http://localhost:0/~cmd to C:\Users\MathSa04\bin\Sencha\Architect\Cmd\6.2.2.36...
[INF] Mapping http://localhost:0/ to C:\wamp\www.. (http://www..).
[INF] Server started at port : 18638
[INF] Application available at http://localhost:18638
[WRN] Disabling framework : current version 6.0.0.640 is incompatible with required version 6.2.1.167
[INF] Loading compiler context
[ERR]
[ERR] BUILD FAILED
[ERR] com.sencha.exceptions.BasicException: java.lang.NullPointerException
[ERR] at com.sencha.command.environment.AppEnvironment.getClassPathSco
[ERR] pe(AppEnvironment.java:76)
[ERR]
[ERR] Total time: 2 seconds
Exception in thread "Thread-17" com.sencha.exceptions.BasicException: com.sencha.exceptions.BasicException: The following error occurred while executing this line:
C:\wamp\www\test1\.sencha\app\build-impl.xml:247: The following error occurred while executing this line:
C:\wamp\www\test1\.sencha\app\watch-impl.xml:61: The following error occurred while executing this line:
C:\wamp\www\test1\.sencha\app\build-impl.xml:380: The following error occurred while executing this line:
C:\wamp\www\test1\.sencha\app\init-impl.xml:384: com.sencha.exceptions.BasicException: java.lang.NullPointerException
at com.sencha.tools.server.service.tasks.DispatchTask.execute(DispatchTask.java:55)
at com.sencha.tools.server.service.tasks.BaseServiceTask$1.run(BaseServiceTask.java:42)
at com.sencha.util.ThreadUtil$1.run(ThreadUtil.java:65)
at com.sencha.util.ThreadUtil$2.run(ThreadUtil.java:162)
at java.lang.Thread.run(Unknown Source)
Caused by: com.sencha.exceptions.BasicException: The following error occurred while executing this line:
C:\wamp\www\test1\.sencha\app\build-impl.xml:247: The following error occurred while executing this line:
C:\wamp\www\test1\.sencha\app\watch-impl.xml:61: The following error occurred while executing this line:
C:\wamp\www\test1\.sencha\app\build-impl.xml:380: The following error occurred while executing this line:
C:\wamp\www\test1\.sencha\app\init-impl.xml:384: com.sencha.exceptions.BasicException: java.lang.NullPointerException
at com.sencha.exceptions.BasicException.wrap(BasicException.java:54)
at com.sencha.ant.AntScript.execute(AntScript.java:120)
at com.sencha.command.plugin.PluginManager.execute(PluginManager.java:104)
at com.sencha.command.plugin.PluginManager.executeReverseFirst(PluginManager.java:145)
at com.sencha.command.environment.BuildEnvironment.execute(BuildEnvironment.java:282)
at com.sencha.command.environment.AppOrPackageEnvironment.execute(AppOrPackageEnvironment.java:771)
at com.sencha.command.BasePluginCommands$BasePluginCommand.doExecute(BasePluginCommands.java:118)
at com.sencha.command.app.AppCommands$BuildCommand.execute(AppCommands.java:384)
at com.sencha.command.app.AppCommands$WatchCommand.execute(AppCommands.java:614)
at sun.reflect.NativeMethodAccessorImpl.invoke0(Native Method)
at sun.reflect.NativeMethodAccessorImpl.invoke(Unknown Source)
at sun.reflect.DelegatingMethodAccessorImpl.invoke(Unknown Source)
at java.lang.reflect.Method.invoke(Unknown Source)
at com.sencha.util.MethodInvoker$Arguments.invoke(MethodInvoker.java:175)
at com.sencha.cli.Command.dispatch(Command.java:43)
at com.sencha.command.BasePluginCommands$BasePluginCommand.dispatch(BasePluginCommands.java:282)
at com.sencha.cli.Commands.dispatch(Commands.java:64)
at com.sencha.cli.Commands.dispatch(Commands.java:64)
at com.sencha.command.Sencha.dispatch(Sencha.java:79)
at com.sencha.cli.AbstractCommand.dispatch(AbstractCommand.java:124)
at com.sencha.tools.server.service.tasks.DispatchTask.execute(DispatchTask.java:52)
... 4 more
Caused by: C:\Users\MathSa04\bin\Sencha\Architect\Cmd\6.2.2.36\plugin.xml:384: The following error occurred while executing this line:
C:\wamp\www\test1\.sencha\app\build-impl.xml:247: The following error occurred while executing this line:
C:\wamp\www\test1\.sencha\app\watch-impl.xml:61: The following error occurred while executing this line:
C:\wamp\www\test1\.sencha\app\build-impl.xml:380: The following error occurred while executing this line:
C:\wamp\www\test1\.sencha\app\init-impl.xml:384: com.sencha.exceptions.BasicException: java.lang.NullPointerException
at org.apache.tools.ant.ProjectHelper.addLocationToBuildException(ProjectHelper.java:551)
at org.apache.tools.ant.taskdefs.Ant.execute(Ant.java:444)
at org.apache.tools.ant.UnknownElement.execute(UnknownElement.java:291)
at sun.reflect.GeneratedMethodAccessor26.invoke(Unknown Source)
at sun.reflect.DelegatingMethodAccessorImpl.invoke(Unknown Source)
at java.lang.reflect.Method.invoke(Unknown Source)
at org.apache.tools.ant.dispatch.DispatchUtils.execute(DispatchUtils.java:106)
at org.apache.tools.ant.Task.perform(Task.java:348)
at org.apache.tools.ant.taskdefs.Sequential.execute(Sequential.java:68)
at net.sf.antcontrib.logic.IfTask.execute(IfTask.java:217)
at sun.reflect.NativeMethodAccessorImpl.invoke0(Native Method)
at sun.reflect.NativeMethodAccessorImpl.invoke(Unknown Source)
at sun.reflect.DelegatingMethodAccessorImpl.invoke(Unknown Source)
at java.lang.reflect.Method.invoke(Unknown Source)
at org.apache.tools.ant.dispatch.DispatchUtils.execute(DispatchUtils.java:106)
at org.apache.tools.ant.TaskAdapter.execute(TaskAdapter.java:154)
at org.apache.tools.ant.UnknownElement.execute(UnknownElement.java:291)
at sun.reflect.NativeMethodAccessorImpl.invoke0(Native Method)
at sun.reflect.NativeMethodAccessorImpl.invoke(Unknown Source)
at sun.reflect.DelegatingMethodAccessorImpl.invoke(Unknown Source)
at java.lang.reflect.Method.invoke(Unknown Source)
at org.apache.tools.ant.dispatch.DispatchUtils.execute(DispatchUtils.java:106)
at org.apache.tools.ant.Task.perform(Task.java:348)
at org.apache.tools.ant.Target.execute(Target.java:392)
at org.apache.tools.ant.Target.performTasks(Target.java:413)
at org.apache.tools.ant.Project.executeSortedTargets(Project.java:1399)
at org.apache.tools.ant.Project.executeTarget(Project.java:1368)
at org.apache.tools.ant.helper.DefaultExecutor.executeTargets(DefaultExecutor.java:41)
at org.apache.tools.ant.Project.executeTargets(Project.java:1251)
at com.sencha.ant.AntScript.execute(AntScript.java:116)
... 23 more
Caused by: C:\wamp\www\test1\.sencha\app\build-impl.xml:247: The following error occurred while executing this line:
C:\wamp\www\test1\.sencha\app\watch-impl.xml:61: The following error occurred while executing this line:
C:\wamp\www\test1\.sencha\app\build-impl.xml:380: The following error occurred while executing this line:
C:\wamp\www\test1\.sencha\app\init-impl.xml:384: com.sencha.exceptions.BasicException: java.lang.NullPointerException
at org.apache.tools.ant.ProjectHelper.addLocationToBuildException(ProjectHelper.java:551)
at org.apache.tools.ant.taskdefs.Ant.execute(Ant.java:444)
at org.apache.tools.ant.taskdefs.CallTarget.execute(CallTarget.java:105)
at com.sencha.ant.CallTask.execute(CallTask.java:137)
at org.apache.tools.ant.UnknownElement.execute(UnknownElement.java:291)
at sun.reflect.GeneratedMethodAccessor26.invoke(Unknown Source)
at sun.reflect.DelegatingMethodAccessorImpl.invoke(Unknown Source)
at java.lang.reflect.Method.invoke(Unknown Source)
at org.apache.tools.ant.dispatch.DispatchUtils.execute(DispatchUtils.java:106)
at org.apache.tools.ant.Task.perform(Task.java:348)
at org.apache.tools.ant.Target.execute(Target.java:392)
at org.apache.tools.ant.Target.performTasks(Target.java:413)
at org.apache.tools.ant.Project.executeSortedTargets(Project.java:1399)
at org.apache.tools.ant.helper.SingleCheckExecutor.executeTargets(SingleCheckExecutor.java:38)
at org.apache.tools.ant.Project.executeTargets(Project.java:1251)
at org.apache.tools.ant.taskdefs.Ant.execute(Ant.java:442)
... 51 more
Caused by: C:\wamp\www\test1\.sencha\app\watch-impl.xml:61: The following error occurred while executing this line:
C:\wamp\www\test1\.sencha\app\build-impl.xml:380: The following error occurred while executing this line:
C:\wamp\www\test1\.sencha\app\init-impl.xml:384: com.sencha.exceptions.BasicException: java.lang.NullPointerException
at org.apache.tools.ant.ProjectHelper.addLocationToBuildException(ProjectHelper.java:551)
at org.apache.tools.ant.taskdefs.Ant.execute(Ant.java:444)
at org.apache.tools.ant.taskdefs.CallTarget.execute(CallTarget.java:105)
at com.sencha.ant.CallTask.execute(CallTask.java:137)
at org.apache.tools.ant.UnknownElement.execute(UnknownElement.java:291)
at sun.reflect.GeneratedMethodAccessor26.invoke(Unknown Source)
at sun.reflect.DelegatingMethodAccessorImpl.invoke(Unknown Source)
at java.lang.reflect.Method.invoke(Unknown Source)
at org.apache.tools.ant.dispatch.DispatchUtils.execute(DispatchUtils.java:106)
at org.apache.tools.ant.Task.perform(Task.java:348)
at org.apache.tools.ant.Target.execute(Target.java:392)
at org.apache.tools.ant.Target.performTasks(Target.java:413)
at org.apache.tools.ant.Project.executeSortedTargets(Project.java:1399)
at org.apache.tools.ant.helper.SingleCheckExecutor.executeTargets(SingleCheckExecutor.java:38)
at org.apache.tools.ant.Project.executeTargets(Project.java:1251)
at org.apache.tools.ant.taskdefs.Ant.execute(Ant.java:442)
... 65 more
Caused by: C:\wamp\www\test1\.sencha\app\build-impl.xml:380: The following error occurred while executing this line:
C:\wamp\www\test1\.sencha\app\init-impl.xml:384: com.sencha.exceptions.BasicException: java.lang.NullPointerException
at org.apache.tools.ant.ProjectHelper.addLocationToBuildException(ProjectHelper.java:551)
at org.apache.tools.ant.taskdefs.Ant.execute(Ant.java:444)
at org.apache.tools.ant.taskdefs.CallTarget.execute(CallTarget.java:105)
at com.sencha.ant.CallTask.execute(CallTask.java:137)
at org.apache.tools.ant.UnknownElement.execute(UnknownElement.java:291)
at sun.reflect.GeneratedMethodAccessor26.invoke(Unknown Source)
at sun.reflect.DelegatingMethodAccessorImpl.invoke(Unknown Source)
at java.lang.reflect.Method.invoke(Unknown Source)
at org.apache.tools.ant.dispatch.DispatchUtils.execute(DispatchUtils.java:106)
at org.apache.tools.ant.Task.perform(Task.java:348)
at org.apache.tools.ant.Target.execute(Target.java:392)
at org.apache.tools.ant.Target.performTasks(Target.java:413)
at org.apache.tools.ant.Project.executeSortedTargets(Project.java:1399)
at org.apache.tools.ant.helper.SingleCheckExecutor.executeTargets(SingleCheckExecutor.java:38)
at org.apache.tools.ant.Project.executeTargets(Project.java:1251)
at org.apache.tools.ant.taskdefs.Ant.execute(Ant.java:442)
... 79 more
Caused by: C:\wamp\www\test1\.sencha\app\init-impl.xml:384: com.sencha.exceptions.BasicException: java.lang.NullPointerException
at org.apache.tools.ant.dispatch.DispatchUtils.execute(DispatchUtils.java:116)
at org.apache.tools.ant.Task.perform(Task.java:348)
at org.apache.tools.ant.Target.execute(Target.java:392)
at org.apache.tools.ant.Target.performTasks(Target.java:413)
at org.apache.tools.ant.Project.executeSortedTargets(Project.java:1399)
at org.apache.tools.ant.helper.SingleCheckExecutor.executeTargets(SingleCheckExecutor.java:38)
at org.apache.tools.ant.Project.executeTargets(Project.java:1251)
at org.apache.tools.ant.taskdefs.Ant.execute(Ant.java:442)
... 93 more
Caused by: com.sencha.exceptions.BasicException: java.lang.NullPointerException
at com.sencha.cli.AbstractCommand$Property.set(AbstractCommand.java:408)
at com.sencha.cli.AbstractCommand.processConfigParam(AbstractCommand.java:530)
at com.sencha.cli.AbstractCommand.configure(AbstractCommand.java:114)
at com.sencha.cli.Commands.dispatch(Commands.java:52)
at com.sencha.command.compile.CompileCommands.dispatch(CompileCommands.java:327)
at com.sencha.cli.AbstractCommand.dispatch(AbstractCommand.java:124)
at com.sencha.ant.CompileTask$CompileToken.initialize(CompileTask.java:156)
at com.sencha.ant.CompileTask$CompileToken.dispatchCommand(CompileTask.java:163)
at com.sencha.ant.CompileTask.doExecute(CompileTask.java:123)
at com.sencha.ant.BaseAntTask.execute(BaseAntTask.java:34)
at com.sencha.ant.CompileTask.execute(CompileTask.java:36)
at org.apache.tools.ant.UnknownElement.execute(UnknownElement.java:291)
at sun.reflect.GeneratedMethodAccessor26.invoke(Unknown Source)
at sun.reflect.DelegatingMethodAccessorImpl.invoke(Unknown Source)
at java.lang.reflect.Method.invoke(Unknown Source)
at org.apache.tools.ant.dispatch.DispatchUtils.execute(DispatchUtils.java:106)
... 100 more
Caused by: java.lang.NullPointerException
at com.sencha.command.environment.AppEnvironment.getClassPathScope(AppEnvironment.java:76)
at com.sencha.command.compile.CompileCommands.setContext(CompileCommands.java:179)
at com.sencha.command.compile.CompileCommands.initContext(CompileCommands.java:212)
at com.sencha.command.compile.CompileCommands.getContext(CompileCommands.java:160)
at com.sencha.command.compile.CompileCommands.setOptions(CompileCommands.java:271)
at sun.reflect.NativeMethodAccessorImpl.invoke0(Native Method)
at sun.reflect.NativeMethodAccessorImpl.invoke(Unknown Source)
at sun.reflect.DelegatingMethodAccessorImpl.invoke(Unknown Source)
at java.lang.reflect.Method.invoke(Unknown Source)
at com.sencha.cli.AbstractCommand$Property.set(AbstractCommand.java:396)
... 115 more

petr.vecera
15 Mar 2017, 2:24 PM
Hello

Could you please post more information about your project? Do you have ext62 or 60 ? That 6.0.0 build looks really old. You could try to go to the project settings, framework , click on disable build tools, save, click on enable build tools, this will re-initialize the Cmd and ext in your project folder.

Regards
Petr